{"text_format":"3","workbook":"xlsx","n_sheets":4,"sheets":["Settings","Overview","details","masterfile"],"not_rendered":{"charts":4,"external_links":1,"defined_names":4},"read":"whole","date_system":"1900"}

{"sheet":"Settings","index":0,"n_rows":4,"n_cols":3,"rows_kept":4}
[]
[null,"Basis year",2017]
[null,"Current Year",2022]
[null,"Current Month",12]

{"sheet":"Overview","index":1,"n_rows":127,"n_cols":26,"rows_kept":127}
[]
[null,"Marketing",null,2018,{"$f":"D2+1","v":2019},2020,2021,2022,2023,{"$f":"I2+1","v":2024},2025,2026,{"$f":"L2+1","v":2027},{"$f":"M2+1","v":2028},null,{"$f":"+G2","v":2021},{"$f":"+H2","v":2022},{"$f":"G2+1","v":2022},"Budget","PY",null,{"$f":"+G2","v":2021},{"$f":"+H2","v":2022},{"$f":"+W2","v":2022},"Budget","PY"]
[null,"in TEUR",null,"PY","PY","PY","PY","FC","B","B","B","B","B","B",null,"PY YTD","B YTD","A YTD","Δ %","Δ %",null,"PY","B","FC","Δ %","Δ %"]
[]
[null,"Channel"]
[]
[null,{"$f":"+masterfile!A2","v":"Online"}]
[null,"Costs",null,{"$f":"+SUMIFS(details!$G:$G,details!$A:$A,Overview!$B7,details!$L:$L,Overview!D$2)","v":939},{"$f":"+SUMIFS(details!$G:$G,details!$A:$A,Overview!$B7,details!$L:$L,Overview!E$2)","v":939},{"$f":"+SUMIFS(details!$G:$G,details!$A:$A,Overview!$B7,details!$L:$L,Overview!F$2)","v":939},{"$f":"+SUMIFS(details!$G:$G,details!$A:$A,Overview!$B7,details!$L:$L,Overview!G$2)","v":939},{"$f":"+R8+W8-Q8","v":939},{"$f":"+SUMIFS(details!$F:$F,details!$A:$A,Overview!$B7,details!$L:$L,Overview!I$2)","v":939},{"$f":"+SUMIFS(details!$F:$F,details!$A:$A,Overview!$B7,details!$L:$L,Overview!J$2)","v":939},{"$f":"+SUMIFS(details!$F:$F,details!$A:$A,Overview!$B7,details!$L:$L,Overview!K$2)","v":939},{"$f":"+SUMIFS(details!$F:$F,details!$A:$A,Overview!$B7,details!$L:$L,Overview!L$2)","v":939},{"$f":"+SUMIFS(details!$F:$F,details!$A:$A,Overview!$B7,details!$L:$L,Overview!M$2)","v":939},{"$f":"+SUMIFS(details!$F:$F,details!$A:$A,Overview!$B7,details!$L:$L,Overview!N$2)","v":939},null,{"$f":"+SUMIFS(details!$G:$G,details!$A:$A,Overview!$B7,details!$L:$L,Overview!P$2,details!$K:$K,\"<=\"&Settings!$C$4)","v":939},{"$f":"+SUMIFS(details!$F:$F,details!$A:$A,Overview!$B7,details!$L:$L,Overview!Q$2,details!$K:$K,\"<=\"&Settings!$C$4)","v":939},{"$f":"+SUMIFS(details!$G:$G,details!$A:$A,Overview!$B7,details!$L:$L,Overview!R$2,details!$K:$K,\"<=\"&Settings!$C$4)","v":939},{"$f":"IFERROR(R8/Q8-1,\"n/a\")","v":{"v":0,"d":"0%"}},{"$f":"IFERROR(R8/P8-1,\"n/a\")","v":{"v":0,"d":"0%"}},null,{"$f":"+G8","v":939},{"$f":"+SUMIFS(details!$F:$F,details!$A:$A,Overview!$B7,details!$L:$L,Overview!W$2)","v":939},{"$f":"+H8","v":939},{"$f":"IFERROR(X8/W8-1,\"n/a\")","v":{"v":0,"d":"0%"}},{"$f":"IFERROR(X8/V8-1,\"n/a\")","v":{"v":0,"d":"0%"}}]
[null,"Revenue",null,{"$f":"+SUMIFS(details!$I:$I,details!$A:$A,Overview!$B7,details!$L:$L,Overview!D$2)","v":{"v":8315,"d":"8,315"}},{"$f":"+SUMIFS(details!$I:$I,details!$A:$A,Overview!$B7,details!$L:$L,Overview!E$2)","v":{"v":8315,"d":"8,315"}},{"$f":"+SUMIFS(details!$I:$I,details!$A:$A,Overview!$B7,details!$L:$L,Overview!F$2)","v":{"v":8315,"d":"8,315"}},{"$f":"+SUMIFS(details!$I:$I,details!$A:$A,Overview!$B7,details!$L:$L,Overview!G$2)","v":{"v":8315,"d":"8,315"}},{"$f":"+R9+W9-Q9","v":{"v":8315,"d":"8,315"}},{"$f":"+SUMIFS(details!$H:$H,details!$A:$A,Overview!$B7,details!$L:$L,Overview!I$2)","v":{"v":8315,"d":"8,315"}},{"$f":"+SUMIFS(details!$H:$H,details!$A:$A,Overview!$B7,details!$L:$L,Overview!J$2)","v":{"v":8315,"d":"8,315"}},{"$f":"+SUMIFS(details!$H:$H,details!$A:$A,Overview!$B7,details!$L:$L,Overview!K$2)","v":{"v":8315,"d":"8,315"}},{"$f":"+SUMIFS(details!$H:$H,details!$A:$A,Overview!$B7,details!$L:$L,Overview!L$2)","v":{"v":8315,"d":"8,315"}},{"$f":"+SUMIFS(details!$H:$H,details!$A:$A,Overview!$B7,details!$L:$L,Overview!M$2)","v":{"v":8315,"d":"8,315"}},{"$f":"+SUMIFS(details!$H:$H,details!$A:$A,Overview!$B7,details!$L:$L,Overview!N$2)","v":{"v":8315,"d":"8,315"}},null,{"$f":"+SUMIFS(details!$I:$I,details!$A:$A,Overview!$B7,details!$L:$L,Overview!P$2,details!$K:$K,\"<=\"&Settings!$C$4)","v":{"v":8315,"d":"8,315"}},{"$f":"+SUMIFS(details!$H:$H,details!$A:$A,Overview!$B7,details!$L:$L,Overview!Q$2,details!$K:$K,\"<=\"&Settings!$C$4)","v":{"v":8315,"d":"8,315"}},{"$f":"+SUMIFS(details!$I:$I,details!$A:$A,Overview!$B7,details!$L:$L,Overview!R$2,details!$K:$K,\"<=\"&Settings!$C$4)","v":{"v":8315,"d":"8,315"}},{"v":0,"d":"0%"},{"v":0,"d":"0%"},null,{"$f":"+G9","v":{"v":8315,"d":"8,315"}},{"$f":"+SUMIFS(details!$H:$H,details!$A:$A,Overview!$B7,details!$L:$L,Overview!W$2)","v":{"v":8315,"d":"8,315"}},{"$f":"+H9","v":{"v":8315,"d":"8,315"}},{"v":0,"d":"0%"},{"v":0,"d":"0%"}]
[null,"Project count",null,{"$f":"+COUNTIFS(details!$A:$A,Overview!$B7,details!$L:$L,Overview!D$2)","v":33},{"$f":"+COUNTIFS(details!$A:$A,Overview!$B7,details!$L:$L,Overview!E$2)","v":33},{"$f":"+COUNTIFS(details!$A:$A,Overview!$B7,details!$L:$L,Overview!F$2)","v":33},{"$f":"+COUNTIFS(details!$A:$A,Overview!$B7,details!$L:$L,Overview!G$2)","v":33},{"$f":"+R10+W10-Q10","v":33},{"$f":"+COUNTIFS(details!$A:$A,Overview!$B7,details!$L:$L,Overview!I$2)","v":33},{"$f":"+COUNTIFS(details!$A:$A,Overview!$B7,details!$L:$L,Overview!J$2)","v":33},{"$f":"+COUNTIFS(details!$A:$A,Overview!$B7,details!$L:$L,Overview!K$2)","v":33},{"$f":"+COUNTIFS(details!$A:$A,Overview!$B7,details!$L:$L,Overview!L$2)","v":33},{"$f":"+COUNTIFS(details!$A:$A,Overview!$B7,details!$L:$L,Overview!M$2)","v":33},{"$f":"+COUNTIFS(details!$A:$A,Overview!$B7,details!$L:$L,Overview!N$2)","v":33},null,{"$f":"+COUNTIFS(details!$A:$A,Overview!$B7,details!$L:$L,Overview!G$2,details!$K:$K,\"<=\"&Settings!$C$4)","v":33},{"$f":"+COUNTIFS(details!$A:$A,Overview!$B7,details!$L:$L,Overview!Q$2,details!$K:$K,\"<=\"&Settings!$C$4)","v":33},{"$f":"+COUNTIFS(details!$A:$A,Overview!$B7,details!$L:$L,Overview!I$2,details!$K:$K,\"<=\"&Settings!$C$4)","v":33},{"v":0,"d":"0%"},{"v":0,"d":"0%"},null,33,{"$f":"+COUNTIFS(details!$A:$A,Overview!$B7,details!$L:$L,Overview!W$2)","v":33},33,{"v":0,"d":"0%"},{"v":0,"d":"0%"}]
[]
[null,{"$f":"+masterfile!A3","v":"Print"}]
[null,"Costs",null,{"$f":"+SUMIFS(details!$G:$G,details!$A:$A,Overview!$B12,details!$L:$L,Overview!D$2)","v":268},{"$f":"+SUMIFS(details!$G:$G,details!$A:$A,Overview!$B12,details!$L:$L,Overview!E$2)","v":268},{"$f":"+SUMIFS(details!$G:$G,details!$A:$A,Overview!$B12,details!$L:$L,Overview!F$2)","v":268},{"$f":"+SUMIFS(details!$G:$G,details!$A:$A,Overview!$B12,details!$L:$L,Overview!G$2)","v":268},{"$f":"+R13+W13-Q13","v":268},{"$f":"+SUMIFS(details!$F:$F,details!$A:$A,Overview!$B12,details!$L:$L,Overview!I$2)","v":268},{"$f":"+SUMIFS(details!$F:$F,details!$A:$A,Overview!$B12,details!$L:$L,Overview!J$2)","v":268},{"$f":"+SUMIFS(details!$F:$F,details!$A:$A,Overview!$B12,details!$L:$L,Overview!K$2)","v":268},{"$f":"+SUMIFS(details!$F:$F,details!$A:$A,Overview!$B12,details!$L:$L,Overview!L$2)","v":268},{"$f":"+SUMIFS(details!$F:$F,details!$A:$A,Overview!$B12,details!$L:$L,Overview!M$2)","v":268},{"$f":"+SUMIFS(details!$F:$F,details!$A:$A,Overview!$B12,details!$L:$L,Overview!N$2)","v":268},null,{"$f":"+SUMIFS(details!$G:$G,details!$A:$A,Overview!$B12,details!$L:$L,Overview!P$2,details!$K:$K,\"<=\"&Settings!$C$4)","v":268},{"$f":"+SUMIFS(details!$F:$F,details!$A:$A,Overview!$B12,details!$L:$L,Overview!Q$2,details!$K:$K,\"<=\"&Settings!$C$4)","v":243},{"$f":"+SUMIFS(details!$G:$G,details!$A:$A,Overview!$B12,details!$L:$L,Overview!R$2,details!$K:$K,\"<=\"&Settings!$C$4)","v":268},{"$f":"IFERROR(R13/Q13-1,\"n/a\")","v":{"v":0.10288065843621408,"d":"10%"}},{"$f":"IFERROR(R13/P13-1,\"n/a\")","v":{"v":0,"d":"0%"}},null,{"$f":"+G13","v":268},{"$f":"+SUMIFS(details!$F:$F,details!$A:$A,Overview!$B12,details!$L:$L,Overview!W$2)","v":243},{"$f":"+H13","v":268},{"$f":"IFERROR(X13/W13-1,\"n/a\")","v":{"v":0.10288065843621408,"d":"10%"}},{"$f":"IFERROR(X13/V13-1,\"n/a\")","v":{"v":0,"d":"0%"}}]
[null,"Revenue",null,{"$f":"+SUMIFS(details!$I:$I,details!$A:$A,Overview!$B12,details!$L:$L,Overview!D$2)","v":315},{"$f":"+SUMIFS(details!$I:$I,details!$A:$A,Overview!$B12,details!$L:$L,Overview!E$2)","v":315},{"$f":"+SUMIFS(details!$I:$I,details!$A:$A,Overview!$B12,details!$L:$L,Overview!F$2)","v":315},{"$f":"+SUMIFS(details!$I:$I,details!$A:$A,Overview!$B12,details!$L:$L,Overview!G$2)","v":315},{"$f":"+R14+W14-Q14","v":320},{"$f":"+SUMIFS(details!$H:$H,details!$A:$A,Overview!$B12,details!$L:$L,Overview!I$2)","v":315},{"$f":"+SUMIFS(details!$H:$H,details!$A:$A,Overview!$B12,details!$L:$L,Overview!J$2)","v":315},{"$f":"+SUMIFS(details!$H:$H,details!$A:$A,Overview!$B12,details!$L:$L,Overview!K$2)","v":315},{"$f":"+SUMIFS(details!$H:$H,details!$A:$A,Overview!$B12,details!$L:$L,Overview!L$2)","v":315},{"$f":"+SUMIFS(details!$H:$H,details!$A:$A,Overview!$B12,details!$L:$L,Overview!M$2)","v":315},{"$f":"+SUMIFS(details!$H:$H,details!$A:$A,Overview!$B12,details!$L:$L,Overview!N$2)","v":315},null,{"$f":"+SUMIFS(details!$I:$I,details!$A:$A,Overview!$B12,details!$L:$L,Overview!P$2,details!$K:$K,\"<=\"&Settings!$C$4)","v":315},{"$f":"+SUMIFS(details!$H:$H,details!$A:$A,Overview!$B12,details!$L:$L,Overview!Q$2,details!$K:$K,\"<=\"&Settings!$C$4)","v":315},{"$f":"+SUMIFS(details!$I:$I,details!$A:$A,Overview!$B12,details!$L:$L,Overview!R$2,details!$K:$K,\"<=\"&Settings!$C$4)","v":320},{"v":0.015873015873015817,"d":"2%"},{"v":0.015873015873015817,"d":"2%"},null,315,{"$f":"+SUMIFS(details!$H:$H,details!$A:$A,Overview!$B12,details!$L:$L,Overview!W$2)","v":315},320,{"v":0.015873015873015817,"d":"2%"},{"v":0.015873015873015817,"d":"2%"}]
[null,"Project count",null,{"$f":"+COUNTIFS(details!$A:$A,Overview!$B12,details!$L:$L,Overview!D$2)","v":14},{"$f":"+COUNTIFS(details!$A:$A,Overview!$B12,details!$L:$L,Overview!E$2)","v":14},{"$f":"+COUNTIFS(details!$A:$A,Overview!$B12,details!$L:$L,Overview!F$2)","v":14},{"$f":"+COUNTIFS(details!$A:$A,Overview!$B12,details!$L:$L,Overview!G$2)","v":14},{"$f":"+R15+W15-Q15","v":14},{"$f":"+COUNTIFS(details!$A:$A,Overview!$B12,details!$L:$L,Overview!I$2)","v":14},{"$f":"+COUNTIFS(details!$A:$A,Overview!$B12,details!$L:$L,Overview!J$2)","v":14},{"$f":"+COUNTIFS(details!$A:$A,Overview!$B12,details!$L:$L,Overview!K$2)","v":14},{"$f":"+COUNTIFS(details!$A:$A,Overview!$B12,details!$L:$L,Overview!L$2)","v":14},{"$f":"+COUNTIFS(details!$A:$A,Overview!$B12,details!$L:$L,Overview!M$2)","v":14},{"$f":"+COUNTIFS(details!$A:$A,Overview!$B12,details!$L:$L,Overview!N$2)","v":14},null,{"$f":"+COUNTIFS(details!$A:$A,Overview!$B12,details!$L:$L,Overview!G$2,details!$K:$K,\"<=\"&Settings!$C$4)","v":14},{"$f":"+COUNTIFS(details!$A:$A,Overview!$B12,details!$L:$L,Overview!Q$2,details!$K:$K,\"<=\"&Settings!$C$4)","v":14},{"$f":"+COUNTIFS(details!$A:$A,Overview!$B12,details!$L:$L,Overview!I$2,details!$K:$K,\"<=\"&Settings!$C$4)","v":14},{"v":0,"d":"0%"},{"v":0,"d":"0%"},null,14,{"$f":"+COUNTIFS(details!$A:$A,Overview!$B12,details!$L:$L,Overview!W$2)","v":14},14,{"v":0,"d":"0%"},{"v":0,"d":"0%"}]
[]
[null,{"$f":"+masterfile!A4","v":"In person"}]
[null,"Costs",null,{"$f":"+SUMIFS(details!$G:$G,details!$A:$A,Overview!$B17,details!$L:$L,Overview!D$2)","v":405},{"$f":"+SUMIFS(details!$G:$G,details!$A:$A,Overview!$B17,details!$L:$L,Overview!E$2)","v":405},{"$f":"+SUMIFS(details!$G:$G,details!$A:$A,Overview!$B17,details!$L:$L,Overview!F$2)","v":405},{"$f":"+SUMIFS(details!$G:$G,details!$A:$A,Overview!$B17,details!$L:$L,Overview!G$2)","v":405},{"$f":"+R18+W18-Q18","v":405},{"$f":"+SUMIFS(details!$F:$F,details!$A:$A,Overview!$B17,details!$L:$L,Overview!I$2)","v":405},{"$f":"+SUMIFS(details!$F:$F,details!$A:$A,Overview!$B17,details!$L:$L,Overview!J$2)","v":405},{"$f":"+SUMIFS(details!$F:$F,details!$A:$A,Overview!$B17,details!$L:$L,Overview!K$2)","v":405},{"$f":"+SUMIFS(details!$F:$F,details!$A:$A,Overview!$B17,details!$L:$L,Overview!L$2)","v":405},{"$f":"+SUMIFS(details!$F:$F,details!$A:$A,Overview!$B17,details!$L:$L,Overview!M$2)","v":405},{"$f":"+SUMIFS(details!$F:$F,details!$A:$A,Overview!$B17,details!$L:$L,Overview!N$2)","v":405},null,{"$f":"+SUMIFS(details!$G:$G,details!$A:$A,Overview!$B17,details!$L:$L,Overview!P$2,details!$K:$K,\"<=\"&Settings!$C$4)","v":405},{"$f":"+SUMIFS(details!$F:$F,details!$A:$A,Overview!$B17,details!$L:$L,Overview!Q$2,details!$K:$K,\"<=\"&Settings!$C$4)","v":405},{"$f":"+SUMIFS(details!$G:$G,details!$A:$A,Overview!$B17,details!$L:$L,Overview!R$2,details!$K:$K,\"<=\"&Settings!$C$4)","v":405},{"$f":"IFERROR(R18/Q18-1,\"n/a\")","v":{"v":0,"d":"0%"}},{"$f":"IFERROR(R18/P18-1,\"n/a\")","v":{"v":0,"d":"0%"}},null,{"$f":"+G18","v":405},{"$f":"+SUMIFS(details!$F:$F,details!$A:$A,Overview!$B17,details!$L:$L,Overview!W$2)","v":405},{"$f":"+H18","v":405},{"$f":"IFERROR(X18/W18-1,\"n/a\")","v":{"v":0,"d":"0%"}},{"$f":"IFERROR(X18/V18-1,\"n/a\")","v":{"v":0,"d":"0%"}}]
[null,"Revenue",null,{"$f":"+SUMIFS(details!$I:$I,details!$A:$A,Overview!$B17,details!$L:$L,Overview!D$2)","v":425},{"$f":"+SUMIFS(details!$I:$I,details!$A:$A,Overview!$B17,details!$L:$L,Overview!E$2)","v":425},{"$f":"+SUMIFS(details!$I:$I,details!$A:$A,Overview!$B17,details!$L:$L,Overview!F$2)","v":425},{"$f":"+SUMIFS(details!$I:$I,details!$A:$A,Overview!$B17,details!$L:$L,Overview!G$2)","v":425},{"$f":"+R19+W19-Q19","v":425},{"$f":"+SUMIFS(details!$H:$H,details!$A:$A,Overview!$B17,details!$L:$L,Overview!I$2)","v":425},{"$f":"+SUMIFS(details!$H:$H,details!$A:$A,Overview!$B17,details!$L:$L,Overview!J$2)","v":425},{"$f":"+SUMIFS(details!$H:$H,details!$A:$A,Overview!$B17,details!$L:$L,Overview!K$2)","v":425},{"$f":"+SUMIFS(details!$H:$H,details!$A:$A,Overview!$B17,details!$L:$L,Overview!L$2)","v":425},{"$f":"+SUMIFS(details!$H:$H,details!$A:$A,Overview!$B17,details!$L:$L,Overview!M$2)","v":425},{"$f":"+SUMIFS(details!$H:$H,details!$A:$A,Overview!$B17,details!$L:$L,Overview!N$2)","v":425},null,{"$f":"+SUMIFS(details!$I:$I,details!$A:$A,Overview!$B17,details!$L:$L,Overview!P$2,details!$K:$K,\"<=\"&Settings!$C$4)","v":425},{"$f":"+SUMIFS(details!$H:$H,details!$A:$A,Overview!$B17,details!$L:$L,Overview!Q$2,details!$K:$K,\"<=\"&Settings!$C$4)","v":425},{"$f":"+SUMIFS(details!$I:$I,details!$A:$A,Overview!$B17,details!$L:$L,Overview!R$2,details!$K:$K,\"<=\"&Settings!$C$4)","v":425},{"v":0,"d":"0%"},{"v":0,"d":"0%"},null,425,{"$f":"+SUMIFS(details!$H:$H,details!$A:$A,Overview!$B17,details!$L:$L,Overview!W$2)","v":425},425,{"v":0,"d":"0%"},{"v":0,"d":"0%"}]
[null,"Project count",null,{"$f":"+COUNTIFS(details!$A:$A,Overview!$B17,details!$L:$L,Overview!D$2)","v":9},{"$f":"+COUNTIFS(details!$A:$A,Overview!$B17,details!$L:$L,Overview!E$2)","v":9},{"$f":"+COUNTIFS(details!$A:$A,Overview!$B17,details!$L:$L,Overview!F$2)","v":9},{"$f":"+COUNTIFS(details!$A:$A,Overview!$B17,details!$L:$L,Overview!G$2)","v":9},{"$f":"+R20+W20-Q20","v":9},{"$f":"+COUNTIFS(details!$A:$A,Overview!$B17,details!$L:$L,Overview!I$2)","v":9},{"$f":"+COUNTIFS(details!$A:$A,Overview!$B17,details!$L:$L,Overview!J$2)","v":9},{"$f":"+COUNTIFS(details!$A:$A,Overview!$B17,details!$L:$L,Overview!K$2)","v":9},{"$f":"+COUNTIFS(details!$A:$A,Overview!$B17,details!$L:$L,Overview!L$2)","v":9},{"$f":"+COUNTIFS(details!$A:$A,Overview!$B17,details!$L:$L,Overview!M$2)","v":9},{"$f":"+COUNTIFS(details!$A:$A,Overview!$B17,details!$L:$L,Overview!N$2)","v":9},null,{"$f":"+COUNTIFS(details!$A:$A,Overview!$B17,details!$L:$L,Overview!G$2,details!$K:$K,\"<=\"&Settings!$C$4)","v":9},{"$f":"+COUNTIFS(details!$A:$A,Overview!$B17,details!$L:$L,Overview!Q$2,details!$K:$K,\"<=\"&Settings!$C$4)","v":9},{"$f":"+COUNTIFS(details!$A:$A,Overview!$B17,details!$L:$L,Overview!I$2,details!$K:$K,\"<=\"&Settings!$C$4)","v":9},{"v":0,"d":"0%"},{"v":0,"d":"0%"},null,9,{"$f":"+COUNTIFS(details!$A:$A,Overview!$B17,details!$L:$L,Overview!W$2)","v":9},9,{"v":0,"d":"0%"},{"v":0,"d":"0%"}]
[]
[null,{"$f":"+masterfile!A5","v":"Merchandise"}]
[null,"Costs",null,{"$f":"+SUMIFS(details!$G:$G,details!$A:$A,Overview!$B22,details!$L:$L,Overview!D$2)","v":5},{"$f":"+SUMIFS(details!$G:$G,details!$A:$A,Overview!$B22,details!$L:$L,Overview!E$2)","v":5},{"$f":"+SUMIFS(details!$G:$G,details!$A:$A,Overview!$B22,details!$L:$L,Overview!F$2)","v":5},{"$f":"+SUMIFS(details!$G:$G,details!$A:$A,Overview!$B22,details!$L:$L,Overview!G$2)","v":5},{"$f":"+R23+W23-Q23","v":5},{"$f":"+SUMIFS(details!$F:$F,details!$A:$A,Overview!$B22,details!$L:$L,Overview!I$2)","v":5},{"$f":"+SUMIFS(details!$F:$F,details!$A:$A,Overview!$B22,details!$L:$L,Overview!J$2)","v":5},{"$f":"+SUMIFS(details!$F:$F,details!$A:$A,Overview!$B22,details!$L:$L,Overview!K$2)","v":5},{"$f":"+SUMIFS(details!$F:$F,details!$A:$A,Overview!$B22,details!$L:$L,Overview!L$2)","v":5},{"$f":"+SUMIFS(details!$F:$F,details!$A:$A,Overview!$B22,details!$L:$L,Overview!M$2)","v":5},{"$f":"+SUMIFS(details!$F:$F,details!$A:$A,Overview!$B22,details!$L:$L,Overview!N$2)","v":5},null,{"$f":"+SUMIFS(details!$G:$G,details!$A:$A,Overview!$B22,details!$L:$L,Overview!P$2,details!$K:$K,\"<=\"&Settings!$C$4)","v":5},{"$f":"+SUMIFS(details!$F:$F,details!$A:$A,Overview!$B22,details!$L:$L,Overview!Q$2,details!$K:$K,\"<=\"&Settings!$C$4)","v":5},{"$f":"+SUMIFS(details!$G:$G,details!$A:$A,Overview!$B22,details!$L:$L,Overview!R$2,details!$K:$K,\"<=\"&Settings!$C$4)","v":5},{"$f":"IFERROR(R23/Q23-1,\"n/a\")","v":{"v":0,"d":"0%"}},{"$f":"IFERROR(R23/P23-1,\"n/a\")","v":{"v":0,"d":"0%"}},null,{"$f":"+G23","v":5},{"$f":"+SUMIFS(details!$F:$F,details!$A:$A,Overview!$B22,details!$L:$L,Overview!W$2)","v":5},{"$f":"+H23","v":5},{"$f":"IFERROR(X23/W23-1,\"n/a\")","v":{"v":0,"d":"0%"}},{"$f":"IFERROR(X23/V23-1,\"n/a\")","v":{"v":0,"d":"0%"}}]
[null,"Revenue",null,{"$f":"+SUMIFS(details!$I:$I,details!$A:$A,Overview!$B22,details!$L:$L,Overview!D$2)","v":0},{"$f":"+SUMIFS(details!$I:$I,details!$A:$A,Overview!$B22,details!$L:$L,Overview!E$2)","v":0},{"$f":"+SUMIFS(details!$I:$I,details!$A:$A,Overview!$B22,details!$L:$L,Overview!F$2)","v":0},{"$f":"+SUMIFS(details!$I:$I,details!$A:$A,Overview!$B22,details!$L:$L,Overview!G$2)","v":0},{"$f":"+R24+W24-Q24","v":0},{"$f":"+SUMIFS(details!$H:$H,details!$A:$A,Overview!$B22,details!$L:$L,Overview!I$2)","v":0},{"$f":"+SUMIFS(details!$H:$H,details!$A:$A,Overview!$B22,details!$L:$L,Overview!J$2)","v":0},{"$f":"+SUMIFS(details!$H:$H,details!$A:$A,Overview!$B22,details!$L:$L,Overview!K$2)","v":0},{"$f":"+SUMIFS(details!$H:$H,details!$A:$A,Overview!$B22,details!$L:$L,Overview!L$2)","v":0},{"$f":"+SUMIFS(details!$H:$H,details!$A:$A,Overview!$B22,details!$L:$L,Overview!M$2)","v":0},{"$f":"+SUMIFS(details!$H:$H,details!$A:$A,Overview!$B22,details!$L:$L,Overview!N$2)","v":0},null,{"$f":"+SUMIFS(details!$I:$I,details!$A:$A,Overview!$B22,details!$L:$L,Overview!P$2,details!$K:$K,\"<=\"&Settings!$C$4)","v":0},{"$f":"+SUMIFS(details!$H:$H,details!$A:$A,Overview!$B22,details!$L:$L,Overview!Q$2,details!$K:$K,\"<=\"&Settings!$C$4)","v":0},{"$f":"+SUMIFS(details!$I:$I,details!$A:$A,Overview!$B22,details!$L:$L,Overview!R$2,details!$K:$K,\"<=\"&Settings!$C$4)","v":0},"n/a","n/a",null,0,{"$f":"+SUMIFS(details!$H:$H,details!$A:$A,Overview!$B22,details!$L:$L,Overview!W$2)","v":0},0,"n/a","n/a"]
[null,"Project count",null,{"$f":"+COUNTIFS(details!$A:$A,Overview!$B22,details!$L:$L,Overview!D$2)","v":5},{"$f":"+COUNTIFS(details!$A:$A,Overview!$B22,details!$L:$L,Overview!E$2)","v":5},{"$f":"+COUNTIFS(details!$A:$A,Overview!$B22,details!$L:$L,Overview!F$2)","v":5},{"$f":"+COUNTIFS(details!$A:$A,Overview!$B22,details!$L:$L,Overview!G$2)","v":5},{"$f":"+R25+W25-Q25","v":5},{"$f":"+COUNTIFS(details!$A:$A,Overview!$B22,details!$L:$L,Overview!I$2)","v":5},{"$f":"+COUNTIFS(details!$A:$A,Overview!$B22,details!$L:$L,Overview!J$2)","v":5},{"$f":"+COUNTIFS(details!$A:$A,Overview!$B22,details!$L:$L,Overview!K$2)","v":5},{"$f":"+COUNTIFS(details!$A:$A,Overview!$B22,details!$L:$L,Overview!L$2)","v":5},{"$f":"+COUNTIFS(details!$A:$A,Overview!$B22,details!$L:$L,Overview!M$2)","v":5},{"$f":"+COUNTIFS(details!$A:$A,Overview!$B22,details!$L:$L,Overview!N$2)","v":5},null,{"$f":"+COUNTIFS(details!$A:$A,Overview!$B22,details!$L:$L,Overview!G$2,details!$K:$K,\"<=\"&Settings!$C$4)","v":5},{"$f":"+COUNTIFS(details!$A:$A,Overview!$B22,details!$L:$L,Overview!Q$2,details!$K:$K,\"<=\"&Settings!$C$4)","v":5},{"$f":"+COUNTIFS(details!$A:$A,Overview!$B22,details!$L:$L,Overview!I$2,details!$K:$K,\"<=\"&Settings!$C$4)","v":5},{"v":0,"d":"0%"},{"v":0,"d":"0%"},null,5,{"$f":"+COUNTIFS(details!$A:$A,Overview!$B22,details!$L:$L,Overview!W$2)","v":5},5,{"v":0,"d":"0%"},{"v":0,"d":"0%"}]
[]
[null,"Total Channels"]
[null,"Costs",null,{"$f":"+D8+D13+D18+D23","v":{"v":1617,"d":"1,617"}},{"$f":"+E8+E13+E18+E23","v":{"v":1617,"d":"1,617"}},{"v":1617,"d":"1,617"},{"v":1617,"d":"1,617"},{"v":1617,"d":"1,617"},{"v":1617,"d":"1,617"},{"v":1617,"d":"1,617"},{"v":1617,"d":"1,617"},{"v":1617,"d":"1,617"},{"$f":"+M8+M13+M18+M23","v":{"v":1617,"d":"1,617"}},{"v":1617,"d":"1,617"},null,{"$f":"+P8+P13+P18+P23","v":{"v":1617,"d":"1,617"}},{"v":1592,"d":"1,592"},{"v":1617,"d":"1,617"},{"$f":"IFERROR(R28/Q28-1,\"n/a\")","v":{"v":0.01570351758793964,"d":"2%"}},{"$f":"IFERROR(R28/P28-1,\"n/a\")","v":{"v":0,"d":"0%"}},null,{"$f":"+V8+V13+V18+V23","v":{"v":1617,"d":"1,617"}},{"v":1592,"d":"1,592"},{"$f":"+X8+X13+X18+X23","v":{"v":1617,"d":"1,617"}},{"$f":"IFERROR(X28/W28-1,\"n/a\")","v":{"v":0.01570351758793964,"d":"2%"}},{"$f":"IFERROR(X28/V28-1,\"n/a\")","v":{"v":0,"d":"0%"}}]
[null,"Revenue",null,{"$f":"+D9+D14+D19+D24","v":{"v":9055,"d":"9,055"}},{"$f":"+E9+E14+E19+E24","v":{"v":9055,"d":"9,055"}},{"v":9055,"d":"9,055"},{"v":9055,"d":"9,055"},{"v":9060,"d":"9,060"},{"v":9055,"d":"9,055"},{"v":9055,"d":"9,055"},{"v":9055,"d":"9,055"},{"v":9055,"d":"9,055"},{"$f":"+M9+M14+M19+M24","v":{"v":9055,"d":"9,055"}},{"v":9055,"d":"9,055"},null,{"$f":"+P9+P14+P19+P24","v":{"v":9055,"d":"9,055"}},{"v":9055,"d":"9,055"},{"v":9060,"d":"9,060"},{"v":0.000552181115405892,"d":"0%"},{"v":0.000552181115405892,"d":"0%"},null,{"$f":"+V9+V14+V19+V24","v":{"v":9055,"d":"9,055"}},{"v":9055,"d":"9,055"},{"$f":"+X9+X14+X19+X24","v":{"v":9060,"d":"9,060"}},{"v":0.000552181115405892,"d":"0%"},{"v":0.000552181115405892,"d":"0%"}]
[null,"Project count",null,{"$f":"+D10+D15+D20+D25","v":61},{"$f":"+E10+E15+E20+E25","v":61},61,61,61,61,61,61,61,{"$f":"+M10+M15+M20+M25","v":61},61,null,{"$f":"+P10+P15+P20+P25","v":61},61,61,{"v":0,"d":"0%"},{"v":0,"d":"0%"},null,{"$f":"+V10+V15+V20+V25","v":61},61,{"$f":"+X10+X15+X20+X25","v":61},{"v":0,"d":"0%"},{"v":0,"d":"0%"}]
{"$rows_left_out":98}
{"sheet":"details","index":2,"n_rows":672,"n_cols":13,"rows_kept":672}
["Channel","Media Type","Segment","Description","Quantity","Expected Costs","Actual Costs","Expected Income","Actual Income","Date","Month","Year","Details"]
["Online","Social media","Segment 1",null,1,50,50,5,5,"2018-07-01",{"$f":"+MONTH(J2)","v":7},{"$f":"+YEAR(J2)","v":2018}]
["Online","Social media","Segment 2",null,1,10,10,10,10,"2018-07-01",{"$f":"+MONTH(J3)","v":7},{"$f":"+YEAR(J3)","v":2018}]
["Online","Social media","Segment 3",null,1,5,5,0,0,"2018-07-01",7,2018]
["Online","Social media","Segment 4",null,1,1,1,0,0,"2018-07-01",7,2018]
["Online","Social media","Segment 5",null,1,1,1,0,0,"2018-07-01",7,2018]
["Online","Website","Segment 1",null,1,150,150,{"v":5000,"d":"5,000"},{"v":5000,"d":"5,000"},"2018-07-01",7,2018]
["Online","Website","Segment 2",null,1,50,50,{"v":1000,"d":"1,000"},{"v":1000,"d":"1,000"},"2018-07-01",{"$f":"+MONTH(J8)","v":7},{"$f":"+YEAR(J8)","v":2018}]
["Online","Website","Segment 3",null,1,10,10,50,50,"2018-07-01",7,2018]
["Online","Website","Segment 4",null,1,1,1,5,5,"2018-07-01",7,2018]
["Online","Website","Segment 5",null,1,1,1,5,5,"2018-07-01",7,2018]
["Online","Search engine","Segment 1",null,1,50,50,{"v":1000,"d":"1,000"},{"v":1000,"d":"1,000"},"2018-07-01",7,2018]
["Online","Search engine","Segment 2",null,1,25,25,250,250,"2018-07-01",7,2018]
["Online","Search engine","Segment 3",null,1,5,5,5,5,"2018-07-01",7,2018]
["Online","Article","Segment 1",null,1,50,50,20,20,"2018-07-01",7,2018]
["Print","Article","Segment 1",null,1,150,150,10,10,"2018-07-01",7,2018]
["Online","Article","Segment 2",null,1,25,25,10,10,"2018-07-01",7,2018]
["Print","Article","Segment 2",null,1,30,30,5,5,"2018-07-01",7,2018]
["Online","Article","Segment 3",null,1,10,10,5,5,"2018-07-01",7,2018]
["Online","Other","Segment 1",null,1,1,1,0,0,"2018-07-01",7,2018]
["Print","Other","Segment 1",null,1,1,1,0,0,"2018-07-01",7,2018]
["In person","Other","Segment 1",null,1,1,1,0,0,"2018-07-01",7,2018]
["Merchandise","Other","Segment 1",null,1,1,1,0,0,"2018-07-01",7,2018]
["Online","Other","Segment 2",null,1,1,1,0,0,"2018-07-01",7,2018]
["Print","Other","Segment 2",null,1,1,1,0,0,"2018-07-01",7,2018]
["In person","Other","Segment 2",null,1,1,1,0,0,"2018-07-01",7,2018]
["Merchandise","Other","Segment 2",null,1,1,1,0,0,"2018-07-01",7,2018]
["Online","Other","Segment 3",null,1,1,1,0,0,"2018-07-01",{"$f":"+MONTH(J28)","v":7},{"$f":"+YEAR(J28)","v":2018}]
["Print","Other","Segment 3",null,1,1,1,0,0,"2018-07-01",7,2018]
["In person","Other","Segment 3",null,1,1,1,0,0,"2018-07-01",7,2018]
{"$rows_left_out":643}
{"sheet":"masterfile","index":3,"n_rows":12,"n_cols":3,"rows_kept":12}
["Channel","Media Type","Segment"]
["Online","Social media","Segment 1"]
["Print","Website","Segment 2"]
["In person","Search engine","Segment 3"]
["Merchandise","Article","Segment 4"]
[null,"Other","Segment 5"]
[null,"Newsletter"]
[null,"Catalog"]
[null,"Flyer"]
[null,"Merchandise"]
[null,"Trade fair"]
[null,"Seminar"]