{"text_format":"3","workbook":"xlsx","n_sheets":3,"sheets":["Overview","Settings","HR"],"not_rendered":{"charts":2},"read":"whole","date_system":"1900"}

{"sheet":"Overview","index":0,"n_rows":41,"n_cols":11,"rows_kept":41}
[]
[null,"HR budget",null,{"$f":"+Settings!C2","v":2021},{"$f":"D2+1","v":2022},{"$f":"E2+1","v":2023},{"$f":"F2+1","v":2024},{"$f":"G2+1","v":2025},{"$f":"H2+1","v":2026},{"$f":"I2+1","v":2027},2028]
[null,"in TEUR",null,"PY","FC","B","B","B","B","B","B"]
[]
[null,"Management",null,{"$f":"+SUMIF(HR!$B:$B,Overview!$B5,HR!K:K)","v":{"v":261.8,"d":"261.80"}},{"$f":"+SUMIF(HR!$B:$B,Overview!$B5,HR!L:L)","v":{"v":261.8,"d":"261.80"}},{"$f":"+SUMIF(HR!$B:$B,Overview!$B5,HR!M:M)","v":{"v":261.8,"d":"261.80"}},{"$f":"+SUMIF(HR!$B:$B,Overview!$B5,HR!N:N)","v":{"v":261.8,"d":"261.80"}},{"$f":"+SUMIF(HR!$B:$B,Overview!$B5,HR!O:O)","v":{"v":261.8,"d":"261.80"}},{"$f":"+SUMIF(HR!$B:$B,Overview!$B5,HR!P:P)","v":{"v":261.8,"d":"261.80"}},{"$f":"+SUMIF(HR!$B:$B,Overview!$B5,HR!Q:Q)","v":{"v":261.8,"d":"261.80"}},{"$f":"+SUMIF(HR!$B:$B,Overview!$B5,HR!R:R)","v":{"v":261.8,"d":"261.80"}}]
[null,"FTE",null,{"$f":"+SUMIFS(HR!$G:$G,HR!$B:$B,Overview!$B5,HR!T:T,\">0\")","v":{"v":1,"d":"1.00"}},{"$f":"+SUMIFS(HR!$G:$G,HR!$B:$B,Overview!$B5,HR!U:U,\">0\")","v":{"v":1,"d":"1.00"}},{"$f":"+SUMIFS(HR!$G:$G,HR!$B:$B,Overview!$B5,HR!V:V,\">0\")","v":{"v":1,"d":"1.00"}},{"$f":"+SUMIFS(HR!$G:$G,HR!$B:$B,Overview!$B5,HR!W:W,\">0\")","v":{"v":1,"d":"1.00"}},{"$f":"+SUMIFS(HR!$G:$G,HR!$B:$B,Overview!$B5,HR!X:X,\">0\")","v":{"v":1,"d":"1.00"}},{"$f":"+SUMIFS(HR!$G:$G,HR!$B:$B,Overview!$B5,HR!Y:Y,\">0\")","v":{"v":1,"d":"1.00"}},{"$f":"+SUMIFS(HR!$G:$G,HR!$B:$B,Overview!$B5,HR!Z:Z,\">0\")","v":{"v":1,"d":"1.00"}},{"$f":"+SUMIFS(HR!$G:$G,HR!$B:$B,Overview!$B5,HR!AA:AA,\">0\")","v":{"v":1,"d":"1.00"}}]
[]
[null,"Secretariat",null,{"$f":"+SUMIF(HR!$B:$B,Overview!$B8,HR!K:K)","v":{"v":59.5,"d":"59.50"}},{"$f":"+SUMIF(HR!$B:$B,Overview!$B8,HR!L:L)","v":{"v":59.5,"d":"59.50"}},{"$f":"+SUMIF(HR!$B:$B,Overview!$B8,HR!M:M)","v":{"v":61.642,"d":"61.64"}},{"$f":"+SUMIF(HR!$B:$B,Overview!$B8,HR!N:N)","v":{"v":63.31276000000001,"d":"63.31"}},{"$f":"+SUMIF(HR!$B:$B,Overview!$B8,HR!O:O)","v":{"v":64.46001520000002,"d":"64.46"}},{"$f":"+SUMIF(HR!$B:$B,Overview!$B8,HR!P:P)","v":{"v":65.63021550400002,"d":"65.63"}},{"$f":"+SUMIF(HR!$B:$B,Overview!$B8,HR!Q:Q)","v":{"v":68.01381981408001,"d":"68.01"}},{"$f":"+SUMIF(HR!$B:$B,Overview!$B8,HR!R:R)","v":{"v":70.42129621036162,"d":"70.42"}}]
[null,"FTE",null,{"$f":"+SUMIFS(HR!$G:$G,HR!$B:$B,Overview!$B8,HR!T:T,\">0\")","v":{"v":1,"d":"1.00"}},{"$f":"+SUMIFS(HR!$G:$G,HR!$B:$B,Overview!$B8,HR!U:U,\">0\")","v":{"v":1,"d":"1.00"}},{"$f":"+SUMIFS(HR!$G:$G,HR!$B:$B,Overview!$B8,HR!V:V,\">0\")","v":{"v":1,"d":"1.00"}},{"$f":"+SUMIFS(HR!$G:$G,HR!$B:$B,Overview!$B8,HR!W:W,\">0\")","v":{"v":1,"d":"1.00"}},{"$f":"+SUMIFS(HR!$G:$G,HR!$B:$B,Overview!$B8,HR!X:X,\">0\")","v":{"v":1,"d":"1.00"}},{"$f":"+SUMIFS(HR!$G:$G,HR!$B:$B,Overview!$B8,HR!Y:Y,\">0\")","v":{"v":1,"d":"1.00"}},{"$f":"+SUMIFS(HR!$G:$G,HR!$B:$B,Overview!$B8,HR!Z:Z,\">0\")","v":{"v":1,"d":"1.00"}},{"$f":"+SUMIFS(HR!$G:$G,HR!$B:$B,Overview!$B8,HR!AA:AA,\">0\")","v":{"v":1,"d":"1.00"}}]
[]
[null,"Sales",null,{"$f":"+SUMIF(HR!$B:$B,Overview!$B11,HR!K:K)","v":55.93},{"$f":"+SUMIF(HR!$B:$B,Overview!$B11,HR!L:L)","v":54.74},{"$f":"+SUMIF(HR!$B:$B,Overview!$B11,HR!M:M)","v":{"v":58.072,"d":"58.07"}},{"$f":"+SUMIF(HR!$B:$B,Overview!$B11,HR!N:N)","v":{"v":59.74276000000001,"d":"59.74"}},{"$f":"+SUMIF(HR!$B:$B,Overview!$B11,HR!O:O)","v":{"v":60.890015200000015,"d":"60.89"}},{"$f":"+SUMIF(HR!$B:$B,Overview!$B11,HR!P:P)","v":{"v":62.06021550400001,"d":"62.06"}},{"$f":"+SUMIF(HR!$B:$B,Overview!$B11,HR!Q:Q)","v":{"v":64.44381981408002,"d":"64.44"}},{"$f":"+SUMIF(HR!$B:$B,Overview!$B11,HR!R:R)","v":{"v":66.85129621036162,"d":"66.85"}}]
[null,"FTE",null,{"$f":"+SUMIFS(HR!$G:$G,HR!$B:$B,Overview!$B11,HR!T:T,\">0\")","v":{"v":1,"d":"1.00"}},{"$f":"+SUMIFS(HR!$G:$G,HR!$B:$B,Overview!$B11,HR!U:U,\">0\")","v":{"v":1,"d":"1.00"}},{"$f":"+SUMIFS(HR!$G:$G,HR!$B:$B,Overview!$B11,HR!V:V,\">0\")","v":{"v":1,"d":"1.00"}},{"$f":"+SUMIFS(HR!$G:$G,HR!$B:$B,Overview!$B11,HR!W:W,\">0\")","v":{"v":1,"d":"1.00"}},{"$f":"+SUMIFS(HR!$G:$G,HR!$B:$B,Overview!$B11,HR!X:X,\">0\")","v":{"v":1,"d":"1.00"}},{"$f":"+SUMIFS(HR!$G:$G,HR!$B:$B,Overview!$B11,HR!Y:Y,\">0\")","v":{"v":1,"d":"1.00"}},{"$f":"+SUMIFS(HR!$G:$G,HR!$B:$B,Overview!$B11,HR!Z:Z,\">0\")","v":{"v":1,"d":"1.00"}},{"$f":"+SUMIFS(HR!$G:$G,HR!$B:$B,Overview!$B11,HR!AA:AA,\">0\")","v":{"v":1,"d":"1.00"}}]
[]
[null,"Marketing & Design",null,{"$f":"+SUMIF(HR!$B:$B,Overview!$B14,HR!K:K)","v":{"v":20,"d":"20.00"}},{"$f":"+SUMIF(HR!$B:$B,Overview!$B14,HR!L:L)","v":{"v":45,"d":"45.00"}},{"$f":"+SUMIF(HR!$B:$B,Overview!$B14,HR!M:M)","v":{"v":45,"d":"45.00"}},{"$f":"+SUMIF(HR!$B:$B,Overview!$B14,HR!N:N)","v":{"v":45,"d":"45.00"}},{"$f":"+SUMIF(HR!$B:$B,Overview!$B14,HR!O:O)","v":{"v":45,"d":"45.00"}},{"$f":"+SUMIF(HR!$B:$B,Overview!$B14,HR!P:P)","v":{"v":45,"d":"45.00"}},{"$f":"+SUMIF(HR!$B:$B,Overview!$B14,HR!Q:Q)","v":{"v":46,"d":"46.00"}},{"$f":"+SUMIF(HR!$B:$B,Overview!$B14,HR!R:R)","v":{"v":47,"d":"47.00"}}]
[null,"FTE",null,{"$f":"+SUMIFS(HR!$G:$G,HR!$B:$B,Overview!$B14,HR!T:T,\">0\")","v":{"v":1,"d":"1.00"}},{"$f":"+SUMIFS(HR!$G:$G,HR!$B:$B,Overview!$B14,HR!U:U,\">0\")","v":{"v":1,"d":"1.00"}},{"$f":"+SUMIFS(HR!$G:$G,HR!$B:$B,Overview!$B14,HR!V:V,\">0\")","v":{"v":1,"d":"1.00"}},{"$f":"+SUMIFS(HR!$G:$G,HR!$B:$B,Overview!$B14,HR!W:W,\">0\")","v":{"v":1,"d":"1.00"}},{"$f":"+SUMIFS(HR!$G:$G,HR!$B:$B,Overview!$B14,HR!X:X,\">0\")","v":{"v":1,"d":"1.00"}},{"$f":"+SUMIFS(HR!$G:$G,HR!$B:$B,Overview!$B14,HR!Y:Y,\">0\")","v":{"v":1,"d":"1.00"}},{"$f":"+SUMIFS(HR!$G:$G,HR!$B:$B,Overview!$B14,HR!Z:Z,\">0\")","v":{"v":1,"d":"1.00"}},{"$f":"+SUMIFS(HR!$G:$G,HR!$B:$B,Overview!$B14,HR!AA:AA,\">0\")","v":{"v":1,"d":"1.00"}}]
[]
[null,"Procurement",null,{"$f":"+SUMIF(HR!$B:$B,Overview!$B17,HR!K:K)","v":51.17},{"$f":"+SUMIF(HR!$B:$B,Overview!$B17,HR!L:L)","v":51.17},{"$f":"+SUMIF(HR!$B:$B,Overview!$B17,HR!M:M)","v":{"v":53.169200000000004,"d":"53.17"}},{"$f":"+SUMIF(HR!$B:$B,Overview!$B17,HR!N:N)","v":{"v":54.728576000000004,"d":"54.73"}},{"$f":"+SUMIF(HR!$B:$B,Overview!$B17,HR!O:O)","v":{"v":55.79934752,"d":"55.80"}},{"$f":"+SUMIF(HR!$B:$B,Overview!$B17,HR!P:P)","v":{"v":56.8915344704,"d":"56.89"}},{"$f":"+SUMIF(HR!$B:$B,Overview!$B17,HR!Q:Q)","v":{"v":59.195565159808005,"d":"59.20"}},{"$f":"+SUMIF(HR!$B:$B,Overview!$B17,HR!R:R)","v":{"v":61.52187646300417,"d":"61.52"}}]
[null,"FTE",null,{"$f":"+SUMIFS(HR!$G:$G,HR!$B:$B,Overview!$B17,HR!T:T,\">0\")","v":{"v":1,"d":"1.00"}},{"$f":"+SUMIFS(HR!$G:$G,HR!$B:$B,Overview!$B17,HR!U:U,\">0\")","v":{"v":1,"d":"1.00"}},{"$f":"+SUMIFS(HR!$G:$G,HR!$B:$B,Overview!$B17,HR!V:V,\">0\")","v":{"v":1,"d":"1.00"}},{"$f":"+SUMIFS(HR!$G:$G,HR!$B:$B,Overview!$B17,HR!W:W,\">0\")","v":{"v":1,"d":"1.00"}},{"$f":"+SUMIFS(HR!$G:$G,HR!$B:$B,Overview!$B17,HR!X:X,\">0\")","v":{"v":1,"d":"1.00"}},{"$f":"+SUMIFS(HR!$G:$G,HR!$B:$B,Overview!$B17,HR!Y:Y,\">0\")","v":{"v":1,"d":"1.00"}},{"$f":"+SUMIFS(HR!$G:$G,HR!$B:$B,Overview!$B17,HR!Z:Z,\">0\")","v":{"v":1,"d":"1.00"}},{"$f":"+SUMIFS(HR!$G:$G,HR!$B:$B,Overview!$B17,HR!AA:AA,\">0\")","v":{"v":1,"d":"1.00"}}]
[]
[null,"IT & DevOps",null,{"$f":"+SUMIF(HR!$B:$B,Overview!$B20,HR!K:K)","v":73.78},{"$f":"+SUMIF(HR!$B:$B,Overview!$B20,HR!L:L)","v":73.78},{"$f":"+SUMIF(HR!$B:$B,Overview!$B20,HR!M:M)","v":76.06},{"$f":"+SUMIF(HR!$B:$B,Overview!$B20,HR!N:N)","v":{"v":77.83840000000001,"d":"77.84"}},{"$f":"+SUMIF(HR!$B:$B,Overview!$B20,HR!O:O)","v":{"v":79.05956800000001,"d":"79.06"}},{"$f":"+SUMIF(HR!$B:$B,Overview!$B20,HR!P:P)","v":{"v":80.30515936,"d":"80.31"}},{"$f":"+SUMIF(HR!$B:$B,Overview!$B20,HR!Q:Q)","v":{"v":81.57566254720001,"d":"81.58"}},{"$f":"+SUMIF(HR!$B:$B,Overview!$B20,HR!R:R)","v":{"v":82.87157579814401,"d":"82.87"}}]
{"$rows_left_out":22}
{"sheet":"Settings","index":1,"n_rows":9,"n_cols":10,"rows_kept":9}
[]
[null,"Basis year",2021]
[]
[null,null,{"$f":"+Settings!C2","v":2021},{"$f":"C4+1","v":2022},{"$f":"D4+1","v":2023},{"$f":"E4+1","v":2024},{"$f":"F4+1","v":2025},{"$f":"G4+1","v":2026},{"$f":"H4+1","v":2027},2028]
[null,"in TEUR","PY","FC","B","B","B","B","B","B"]
[]
[null,"Inflation",null,null,{"v":0.04,"d":"4.0%"},{"v":0.03,"d":"3.0%"},{"v":0.02,"d":"2.0%"},{"v":0.02,"d":"2.0%"},{"v":0.02,"d":"2.0%"},{"v":0.02,"d":"2.0%"}]
[]
[null,"Buffer",null,null,10,10,10,10,10,10]

{"sheet":"HR","index":2,"n_rows":300,"n_cols":29,"rows_kept":300}
[]
[null,"HR Costs"]
[null,"in TEUR",{"$nulls":8},{"$f":"+Overview!D2","v":2021},{"$f":"K3+1","v":2022},{"$f":"L3+1","v":2023},{"$f":"M3+1","v":2024},{"$f":"N3+1","v":2025},{"$f":"O3+1","v":2026},{"$f":"P3+1","v":2027},2028,null,2021,{"$f":"T3+1","v":2022},{"$f":"U3+1","v":2023},{"$f":"V3+1","v":2024},{"$f":"W3+1","v":2025},{"$f":"X3+1","v":2026},{"$f":"Y3+1","v":2027},2028]
[null,"Department","Position","ID","Name","Type","FTE","Start","End",null,"PY","FC","B","B","B","B","B","B",null,"PY","FC","B","B","B","B","B","B",null,"is last"]
[null,"Sales","Clerk",1,"Name of Worker","Salary",1,"2022-01-01","2199-12-31",null,{"v":45,"d":"45.0"},{"v":45,"d":"45.0"},{"$f":"+L5*(1+Settings!E$7)","v":{"v":46.800000000000004,"d":"46.8"}},{"$f":"+M5*(1+Settings!F$7)","v":{"v":48.20400000000001,"d":"48.2"}},{"$f":"+N5*(1+Settings!G$7)","v":{"v":49.16808000000001,"d":"49.2"}},{"$f":"+O5*(1+Settings!H$7)","v":{"v":50.15144160000001,"d":"50.2"}},{"$f":"+P5*(1+Settings!I$7)","v":{"v":51.15447043200001,"d":"51.2"}},{"$f":"+Q5*(1+Settings!J$7)","v":{"v":52.177559840640015,"d":"52.2"}},null,{"$f":"+IF($AC5=1,SUMIF($D:$D,$D5,K:K),\"\")","v":""},{"$f":"+IF($AC5=1,SUMIF($D:$D,$D5,L:L),\"\")","v":""},{"$f":"+IF($AC5=1,SUMIF($D:$D,$D5,M:M),\"\")","v":""},{"$f":"+IF($AC5=1,SUMIF($D:$D,$D5,N:N),\"\")","v":""},{"$f":"+IF($AC5=1,SUMIF($D:$D,$D5,O:O),\"\")","v":""},{"$f":"+IF($AC5=1,SUMIF($D:$D,$D5,P:P),\"\")","v":""},{"$f":"+IF($AC5=1,SUMIF($D:$D,$D5,Q:Q),\"\")","v":""},{"$f":"+IF($AC5=1,SUMIF($D:$D,$D5,R:R),\"\")","v":""},null,{"$f":"+IF(AND(D5<>\"\",ISERROR(VLOOKUP(D5,D6:$E$1000,1,FALSE))),1,0)","v":0}]
[null,"Sales","Clerk",1,"Name of Worker","Bonus",1,"2022-01-01","2199-12-31",{"$nulls":10},"","","","","","","","",null,{"$f":"+IF(AND(D6<>\"\",ISERROR(VLOOKUP(D6,D7:$E$1000,1,FALSE))),1,0)","v":0}]
[null,"Sales","Clerk",1,"Name of Worker","Bonus accrual",1,"2022-01-01","2199-12-31",null,{"v":2,"d":"2.0"},{"v":1,"d":"1.0"},{"v":2,"d":"2.0"},{"v":2,"d":"2.0"},{"v":2,"d":"2.0"},{"v":2,"d":"2.0"},{"v":3,"d":"3.0"},{"v":4,"d":"4.0"},null,"","","","","","","","",null,{"$f":"+IF(AND(D7<>\"\",ISERROR(VLOOKUP(D7,D8:$E$1000,1,FALSE))),1,0)","v":0}]
[null,"Sales","Clerk",1,"Name of Worker","Other",1,"2022-01-01","2199-12-31",{"$nulls":10},"","","","","","","","",null,{"$f":"+IF(AND(D8<>\"\",ISERROR(VLOOKUP(D8,D9:$E$1000,1,FALSE))),1,0)","v":0}]
[null,"Sales","Clerk",1,"Name of Worker","Social expenditure",1,"2022-01-01","2199-12-31",null,{"$f":"+SUM(K5:K8)*0.19","v":{"v":8.93,"d":"8.9"}},{"$f":"+SUM(L5:L8)*0.19","v":{"v":8.74,"d":"8.7"}},{"v":9.272,"d":"9.3"},{"v":9.538760000000002,"d":"9.5"},{"v":9.721935200000003,"d":"9.7"},{"v":9.908773904000002,"d":"9.9"},{"$f":"+SUM(Q5:Q8)*0.19","v":{"v":10.289349382080003,"d":"10.3"}},{"v":10.673736369721603,"d":"10.7"},null,{"$f":"+IF($AC9=1,SUMIF($D:$D,$D9,K:K),\"\")","v":{"v":55.93,"d":"55.9"}},{"$f":"+IF($AC9=1,SUMIF($D:$D,$D9,L:L),\"\")","v":{"v":54.74,"d":"54.7"}},{"$f":"+IF($AC9=1,SUMIF($D:$D,$D9,M:M),\"\")","v":{"v":58.072,"d":"58.1"}},{"$f":"+IF($AC9=1,SUMIF($D:$D,$D9,N:N),\"\")","v":{"v":59.74276000000001,"d":"59.7"}},{"$f":"+IF($AC9=1,SUMIF($D:$D,$D9,O:O),\"\")","v":{"v":60.890015200000015,"d":"60.9"}},{"$f":"+IF($AC9=1,SUMIF($D:$D,$D9,P:P),\"\")","v":{"v":62.06021550400001,"d":"62.1"}},{"v":64.44381981408002,"d":"64.4"},{"v":66.85129621036162,"d":"66.9"},null,{"$f":"+IF(AND(D9<>\"\",ISERROR(VLOOKUP(D9,D10:$E$1000,1,FALSE))),1,0)","v":1}]
[null,"Marketing & Design","Clerk",2,"Name of Worker","Salary",1,"2022-01-01","2199-12-31",null,{"v":20,"d":"20.0"},{"v":45,"d":"45.0"},{"v":45,"d":"45.0"},{"v":45,"d":"45.0"},{"v":45,"d":"45.0"},{"v":45,"d":"45.0"},{"v":46,"d":"46.0"},{"v":47,"d":"47.0"},null,{"$f":"+IF($AC10=1,SUMIF($D:$D,$D10,K:K),\"\")","v":{"v":20,"d":"20.0"}},{"$f":"+IF($AC10=1,SUMIF($D:$D,$D10,L:L),\"\")","v":{"v":45,"d":"45.0"}},{"$f":"+IF($AC10=1,SUMIF($D:$D,$D10,M:M),\"\")","v":{"v":45,"d":"45.0"}},{"$f":"+IF($AC10=1,SUMIF($D:$D,$D10,N:N),\"\")","v":{"v":45,"d":"45.0"}},{"$f":"+IF($AC10=1,SUMIF($D:$D,$D10,O:O),\"\")","v":{"v":45,"d":"45.0"}},{"$f":"+IF($AC10=1,SUMIF($D:$D,$D10,P:P),\"\")","v":{"v":45,"d":"45.0"}},{"v":46,"d":"46.0"},{"v":47,"d":"47.0"},null,{"$f":"+IF(AND(D10<>\"\",ISERROR(VLOOKUP(D10,D11:$E$1000,1,FALSE))),1,0)","v":1}]
[null,"Development","Clerk",3,"Name of Worker","Salary",1,"2022-01-01","2199-12-31",null,{"v":57,"d":"57.0"},{"v":57,"d":"57.0"},{"$f":"+L11*(1+Settings!E$7)","v":{"v":59.28,"d":"59.3"}},{"$f":"+M11*(1+Settings!F$7)","v":{"v":61.058400000000006,"d":"61.1"}},{"$f":"+N11*(1+Settings!G$7)","v":{"v":62.279568000000005,"d":"62.3"}},{"$f":"+O11*(1+Settings!H$7)","v":{"v":63.52515936,"d":"63.5"}},{"$f":"+P11*(1+Settings!I$7)","v":{"v":64.79566254720001,"d":"64.8"}},{"$f":"+Q11*(1+Settings!J$7)","v":{"v":66.091575798144,"d":"66.1"}},null,"","","","","","","","",null,{"$f":"+IF(AND(D11<>\"\",ISERROR(VLOOKUP(D11,D12:$E$1000,1,FALSE))),1,0)","v":0}]
[null,"Development","Clerk",3,"Name of Worker","Bonus",1,"2022-01-01","2199-12-31",{"$nulls":10},"","","","","","","","",null,{"$f":"+IF(AND(D12<>\"\",ISERROR(VLOOKUP(D12,D13:$E$1000,1,FALSE))),1,0)","v":0}]
[null,"Development","Clerk",3,"Name of Worker","Bonus accrual",1,"2022-01-01","2199-12-31",null,{"v":5,"d":"5.0"},{"v":5,"d":"5.0"},{"v":5,"d":"5.0"},{"v":5,"d":"5.0"},{"v":5,"d":"5.0"},{"v":5,"d":"5.0"},{"v":6,"d":"6.0"},{"v":7,"d":"7.0"},null,"","","","","","","","",null,{"$f":"+IF(AND(D13<>\"\",ISERROR(VLOOKUP(D13,D14:$E$1000,1,FALSE))),1,0)","v":0}]
[null,"Development","Clerk",3,"Name of Worker","Other",1,"2022-01-01","2199-12-31",{"$nulls":10},"","","","","","","","",null,{"$f":"+IF(AND(D14<>\"\",ISERROR(VLOOKUP(D14,D15:$E$1000,1,FALSE))),1,0)","v":0}]
[null,"Development","Clerk",3,"Name of Worker","Social expenditure",1,"2022-01-01","2199-12-31",null,{"$f":"+SUM(K11:K14)*0.19","v":{"v":11.78,"d":"11.8"}},{"$f":"+SUM(L11:L14)*0.19","v":{"v":11.78,"d":"11.8"}},{"$f":"+SUM(M11:M14)*0.19","v":{"v":12.2132,"d":"12.2"}},{"$f":"+SUM(N11:N14)*0.19","v":{"v":12.551096000000001,"d":"12.6"}},{"$f":"+SUM(O11:O14)*0.19","v":{"v":12.783117920000002,"d":"12.8"}},{"$f":"+SUM(P11:P14)*0.19","v":{"v":13.0197802784,"d":"13.0"}},{"v":13.451175883968002,"d":"13.5"},{"v":13.887399401647361,"d":"13.9"},null,{"v":73.78,"d":"73.8"},{"v":73.78,"d":"73.8"},{"v":76.4932,"d":"76.5"},{"v":78.60949600000001,"d":"78.6"},{"v":80.06268592,"d":"80.1"},{"v":81.54493963840001,"d":"81.5"},{"v":84.24683843116802,"d":"84.2"},{"v":86.97897519979136,"d":"87.0"},null,{"$f":"+IF(AND(D15<>\"\",ISERROR(VLOOKUP(D15,D16:$E$1000,1,FALSE))),1,0)","v":1}]
[null,"HR","Clerk",4,"Name of Worker","Salary",1,"2022-01-01","2199-12-31",null,{"v":55,"d":"55.0"},{"v":55,"d":"55.0"},{"$f":"+L16*(1+Settings!E$7)","v":57.2},{"$f":"+M16*(1+Settings!F$7)","v":{"v":58.916000000000004,"d":"58.9"}},{"$f":"+N16*(1+Settings!G$7)","v":{"v":60.09432,"d":"60.1"}},{"$f":"+O16*(1+Settings!H$7)","v":{"v":61.2962064,"d":"61.3"}},{"$f":"+P16*(1+Settings!I$7)","v":{"v":62.522130528000005,"d":"62.5"}},{"$f":"+Q16*(1+Settings!J$7)","v":{"v":63.772573138560006,"d":"63.8"}},null,"","","","","","","","",null,{"$f":"+IF(AND(D16<>\"\",ISERROR(VLOOKUP(D16,D17:$E$1000,1,FALSE))),1,0)","v":0}]
[null,"HR","Clerk",4,"Name of Worker","Bonus",1,"2022-01-01","2199-12-31",{"$nulls":10},"","","","","","","","",null,{"$f":"+IF(AND(D17<>\"\",ISERROR(VLOOKUP(D17,D18:$E$1000,1,FALSE))),1,0)","v":0}]
[null,"HR","Clerk",4,"Name of Worker","Bonus accrual",1,"2022-01-01","2199-12-31",{"$nulls":10},"","","","","","","","",null,{"$f":"+IF(AND(D18<>\"\",ISERROR(VLOOKUP(D18,D19:$E$1000,1,FALSE))),1,0)","v":0}]
[null,"HR","Clerk",4,"Name of Worker","Other",1,"2022-01-01","2199-12-31",{"$nulls":10},"","","","","","","","",null,{"$f":"+IF(AND(D19<>\"\",ISERROR(VLOOKUP(D19,D20:$E$1000,1,FALSE))),1,0)","v":0}]
[null,"HR","Clerk",4,"Name of Worker","Social expenditure",1,"2022-01-01","2199-12-31",null,{"$f":"+SUM(K16:K19)*0.19","v":{"v":10.45,"d":"10.5"}},{"$f":"+SUM(L16:L19)*0.19","v":{"v":10.45,"d":"10.5"}},{"$f":"+SUM(M16:M19)*0.19","v":{"v":10.868,"d":"10.9"}},{"$f":"+SUM(N16:N19)*0.19","v":{"v":11.194040000000001,"d":"11.2"}},{"$f":"+SUM(O16:O19)*0.19","v":{"v":11.417920800000001,"d":"11.4"}},{"$f":"+SUM(P16:P19)*0.19","v":{"v":11.646279216,"d":"11.6"}},{"v":11.879204800320002,"d":"11.9"},{"v":12.116788896326401,"d":"12.1"},null,{"v":65.45,"d":"65.5"},{"v":65.45,"d":"65.5"},{"v":68.068,"d":"68.1"},{"v":70.11004,"d":"70.1"},{"v":71.5122408,"d":"71.5"},{"v":72.942485616,"d":"72.9"},{"v":74.40133532832,"d":"74.4"},{"v":75.8893620348864,"d":"75.9"},null,{"$f":"+IF(AND(D20<>\"\",ISERROR(VLOOKUP(D20,D21:$E$1000,1,FALSE))),1,0)","v":1}]
{"$rows_left_out":280}